Target
Caspase-7
Ligand
BDBM50258381
Substrate
Meas. Tech.
ChEMBL_523093 (CHEMBL1006645)
IC50
2.4±n/a nM
Citation
 Podichetty, AKWagner, SSchröer, SFaust, ASchäfers, MSchober, OKopka, KHaufe, G Fluorinated isatin derivatives. Part 2. New N-substituted 5-pyrrolidinylsulfonyl isatins as potential tools for molecular imaging of caspases in apoptosis. J Med Chem 52:3484-95 (2009)  
Target
Name:
Caspase-7
Synonyms:
Apoptotic protease Mch-3 CASP7 CMH-1 MCH3 | caspase 7, apoptosis-related cysteine peptidase
Type:
Enzyme
Mol. Mass.:
34273.91
Organism:
Homo sapiens (Human)
Description:
P55210
Residue:
303
  
Inhibitor
Name:
BDBM50258381
Synonyms:
(S)-5-[1-(2-Methoxymethylpyrrolidinyl)sulfonyl]-1-[4-(oxiran-2-ylmethoxy)benzyl]isatin | CHEMBL494220
Type:
Small organic molecule
Emp. Form.:
C24H26N2O7S
Mol. Mass.:
486.537
SMILES:
COC[C@@H]1CCCN1S(=O)(=O)c1ccc2N(Cc3ccc(OCC4CO4)cc3)C(=O)C(=O)c2c1
: