Target
Smoothened homolog
Ligand
BDBM50268313
Substrate
Meas. Tech.
ChEMBL_522938 (CHEMBL995460)
IC50
8±n/a nM
Citation
 Miller-Moslin, KPeukert, SJain, RKMcEwan, MAKarki, RLlamas, LYusuff, NHe, FLi, YSun, YDai, MPerez, LMichael, WSheng, TLei, HZhang, RWilliams, JBourret, ARamamurthy, AYuan, JGuo, RMatsumoto, MVattay, AManiara, WAmaral, ADorsch, MKelleher, JF 1-amino-4-benzylphthalazines as orally bioavailable smoothened antagonists with antitumor activity. J Med Chem 52:3954-68 (2009)  
Target
Name:
Smoothened homolog
Synonyms:
G-protein- coupled-like receptor Smoothened (Smo) SMOH Smoothened homolog
Type:
Protein
Mol. Mass.:
86415.51
Organism:
Homo sapiens (Human)
Description:
Q99835
Residue:
787
  
Inhibitor
Name:
BDBM50268313
Synonyms:
2-{6-[4-(4-Benzylphthalazin-1-yl)piperazin-1-yl]pyridin-3-yl}propan-2-ol | CHEMBL485870
Type:
Small organic molecule
Emp. Form.:
C27H29N5O
Mol. Mass.:
439.5521
SMILES:
CC(C)(O)c1ccc(nc1)N1CCN(CC1)c1nnc(Cc2ccccc2)c2ccccc12
: