Target
Bifunctional epoxide hydrolase 2
Ligand
BDBM50268440
Substrate
Meas. Tech.
ChEMBL_523917 (CHEMBL1001510)
IC50
<1±n/a nM
Citation
 Shen, HCDing, FXWang, SXu, SChen, HSTong, XTong, VMitra, KKumar, SZhang, XChen, YZhou, GPai, LYAlonso-Galicia, MChen, XZhang, BTata, JRBerger, JPColletti, SL Discovery of spirocyclic secondary amine-derived tertiary ureas as highly potent, selective and bioavailable soluble epoxide hydrolase inhibitors. Bioorg Med Chem Lett 19:3398-404 (2009)  
Target
Name:
Bifunctional epoxide hydrolase 2
Synonyms:
Cytosolic epoxide hydrolase 2 EPHX2 HYES_HUMAN Soluble epoxide hydrolase (sEH) | epoxide hydrolase 2, cytoplasmic
Type:
Enzyme
Mol. Mass.:
62613.07
Organism:
Homo sapiens (Human)
Description:
P34913
Residue:
555
  
Inhibitor
Name:
BDBM50268440
Synonyms:
2-(2,4-dichlorophenyl)-1-(6-(methylsulfonyl)spiro[chroman-2,4'-piperidine]-1'-yl)ethanone | CHEMBL497829
Type:
Small organic molecule
Emp. Form.:
C22H23Cl2NO4S
Mol. Mass.:
468.393
SMILES:
CS(=O)(=O)c1ccc2OC3(CCN(CC3)C(=O)Cc3ccc(Cl)cc3Cl)CCc2c1
: