Target
Sodium channel protein type 5 subunit alpha
Ligand
BDBM50268383
Substrate
Meas. Tech.
ChEMBL_523923 (CHEMBL1001516)
IC50
>10000±n/a nM
Citation
 Shen, HCDing, FXWang, SXu, SChen, HSTong, XTong, VMitra, KKumar, SZhang, XChen, YZhou, GPai, LYAlonso-Galicia, MChen, XZhang, BTata, JRBerger, JPColletti, SL Discovery of spirocyclic secondary amine-derived tertiary ureas as highly potent, selective and bioavailable soluble epoxide hydrolase inhibitors. Bioorg Med Chem Lett 19:3398-404 (2009)  
Target
Name:
Sodium channel protein type 5 subunit alpha
Synonyms:
HH1 SCN5A_HUMAN Sodium channel protein type 5 subunit alpha/beta-1/beta-2 Voltage-gated sodium channel subunit alpha Nav1.5
Type:
Enzyme
Mol. Mass.:
226908.60
Organism:
Homo sapiens (Human)
Description:
Q14524
Residue:
2016
  
Inhibitor
Name:
BDBM50268383
Synonyms:
4'-hydroxy-N-((trans)-2-phenylcyclopropyl)-3',4'-dihydrospiro[piperidine-4,2'-pyrano[3,2-b]pyridine]-1-carboxamide | CHEMBL523565
Type:
Small organic molecule
Emp. Form.:
C22H25N3O3
Mol. Mass.:
379.4522
SMILES:
OC1CC2(CCN(CC2)C(=O)N[C@H]2C[C@@H]2c2ccccc2)Oc2cccnc12
: