Target
Cytochrome P450 2D6
Ligand
BDBM50268439
Substrate
Meas. Tech.
ChEMBL_523919 (CHEMBL1001512)
IC50
>10000±n/a nM
Citation
 Shen, HCDing, FXWang, SXu, SChen, HSTong, XTong, VMitra, KKumar, SZhang, XChen, YZhou, GPai, LYAlonso-Galicia, MChen, XZhang, BTata, JRBerger, JPColletti, SL Discovery of spirocyclic secondary amine-derived tertiary ureas as highly potent, selective and bioavailable soluble epoxide hydrolase inhibitors. Bioorg Med Chem Lett 19:3398-404 (2009)  
Target
Name:
Cytochrome P450 2D6
Synonyms:
CP2D6_HUMAN CYP2DL1 Cytochrome P450 2D6 (CYP2D6) P450-DB1
Type:
Protein
Mol. Mass.:
55774.82
Organism:
Homo sapiens (Human)
Description:
P10635
Residue:
497
  
Inhibitor
Name:
BDBM50268439
Synonyms:
(6-(methylsulfonyl)spiro[chroman-2,4'-piperidine]-1'-yl)(4-(trifluoromethyl)phenyl)methanone | CHEMBL497828
Type:
Small organic molecule
Emp. Form.:
C22H22F3NO4S
Mol. Mass.:
453.475
SMILES:
CS(=O)(=O)c1ccc2OC3(CCN(CC3)C(=O)c3ccc(cc3)C(F)(F)F)CCc2c1
: