Target
Acetylcholinesterase
Ligand
BDBM50279984
Substrate
Meas. Tech.
ChEBML_28154
IC50
39±n/a nM
Citation
 Desai, MCThadeio, PFLipinski, CAListon, DRSpencer, RWWilliams, IH Physical parameters for brian uptake: optimizing log P, log D and pKa of T H A Bioorg Med Chem Lett 1:411-414 (1991)    Article 
Target
Name:
Acetylcholinesterase
Synonyms:
ACES_HUMAN Acetylcholinesterase (AChE) | Acetylcholinesterase (human AChE)
Type:
Enzyme
Mol. Mass.:
67792.70
Organism:
Homo sapiens (Human)
Description:
P22303
Residue:
614
  
Inhibitor
Name:
BDBM50279984
Synonyms:
8-Chloro-1,2,3,4-tetrahydro-acridin-9-ylamine CHEMBL134057
Type:
Small organic molecule
Emp. Form.:
C13H13ClN2
Mol. Mass.:
232.709
SMILES:
Nc1c2CCCCc2nc2cccc(Cl)c12
: