Target
Acetylcholinesterase
Ligand
BDBM8961
Substrate
Meas. Tech.
ChEBML_28154
IC50
143±n/a nM
Citation
 Desai, MCThadeio, PFLipinski, CAListon, DRSpencer, RWWilliams, IH Physical parameters for brian uptake: optimizing log P, log D and pKa of T H A Bioorg Med Chem Lett 1:411-414 (1991)    Article 
Target
Name:
Acetylcholinesterase
Synonyms:
ACES_HUMAN Acetylcholinesterase (AChE) | Acetylcholinesterase (human AChE)
Type:
Enzyme
Mol. Mass.:
67792.70
Organism:
Homo sapiens (Human)
Description:
P22303
Residue:
614
  
Inhibitor
Name:
BDBM8961
Synonyms:
1,2,3,4-tetrahydro-9-acridinamine 9-THA CHEMBL1337960 Cognex Tracine cid_1935 | tacrine.HCl
Type:
Small organic molecule
Emp. Form.:
C13H14N2
Mol. Mass.:
198.2637
SMILES:
Nc1c2CCCCc2nc2ccccc12
: