Target
Neutral alpha-glucosidase AB
Ligand
BDBM50280031
Substrate
Meas. Tech.
ChEMBL_218086 (CHEMBL822533)
pH
5±n/a
Ki
>1500000±n/a nM
Comments
extracted
Citation
 Berger, ADax, KGradnig, GGrassberger, VStütz, AEUngerank, MLegler, GBause, E Synthesis and biological activity of C-6 modified derivatives of the glucosidase inhibitor 1-deoxynojirimycin. Bioorg Med Chem Lett 2:27-32 (1992)    Article 
Target
Name:
Neutral alpha-glucosidase AB
Synonyms:
Alpha-glucosidase 2 GANAB Glucosidase II subunit alpha | KIAA0088
Type:
PROTEIN
Mol. Mass.:
106864.62
Organism:
Homo sapiens (Human)
Description:
ChEMBL_218093
Residue:
944
  
Inhibitor
Name:
BDBM50280031
Synonyms:
(6S,7R,8R)-Octahydro-indolizine-1,6,7,8-tetraol | CHEMBL421040
Type:
Small organic molecule
Emp. Form.:
C8H15NO4
Mol. Mass.:
189.209
SMILES:
OC1CCN2C[C@H](O)[C@@H](O)[C@H](O)C12
: