Target
Gastrin/cholecystokinin type B receptor
Ligand
BDBM50449521
Substrate
Meas. Tech.
ChEMBL_40204 (CHEMBL652249)
IC50
23±n/a nM
Citation
 Suckling, CJTedford, MCBence, LMIrvine, JIWH, WH The synthesis and CCK receptor affinities of selected carboyxlic acid mimics of CI-988 - a potent and selective CCK-B antagonist Bioorg Med Chem Lett 2:45-8 (1992)   
Target
Name:
Gastrin/cholecystokinin type B receptor
Synonyms:
Cckbr Cholecystokinin receptor Gastrin/cholecystokinin type B receptor
Type:
Enzyme Catalytic Domain
Mol. Mass.:
49196.59
Organism:
MOUSE
Description:
Cholecystokinin A CCKBR MOUSE::P56481
Residue:
453
  
Inhibitor
Name:
BDBM50449521
Synonyms:
CHEMBL2304155
Type:
Small organic molecule
Emp. Form.:
C34H43N4O7P
Mol. Mass.:
650.7016
SMILES:
[H][C@@](CNC(=O)[C@@](C)(Cc1c[nH]c2ccccc12)NC(=O)OC1C2CC3CC(C2)CC1C3)(NC(=O)CCP(O)(O)=O)c1ccccc1
: