Target
Cholecystokinin receptor type A
Ligand
BDBM50449519
Substrate
Meas. Tech.
ChEMBL_40055 (CHEMBL655654)
IC50
1200±n/a nM
Citation
 Suckling, CJTedford, MCBence, LMIrvine, JIWH, WH The synthesis and CCK receptor affinities of selected carboyxlic acid mimics of CI-988 - a potent and selective CCK-B antagonist Bioorg Med Chem Lett 2:45-8 (1992)   
Target
Name:
Cholecystokinin receptor type A
Synonyms:
CCKAR_RAT Cholecystokinin peripheral Cholecystokinin receptor type A
Type:
Enzyme Catalytic Domain
Mol. Mass.:
49676.37
Organism:
RAT
Description:
Cholecystokinin central 0 RAT::P30551
Residue:
444
  
Inhibitor
Name:
BDBM50449519
Synonyms:
CHEMBL2304157
Type:
Small organic molecule
Emp. Form.:
C36H43N9O5
Mol. Mass.:
681.7839
SMILES:
[H][C@@](CNC(=O)[C@@](C)(Cc1c[nH]c2ccccc12)NC(=O)OC1C2CC3CC(C2)CC1C3)(NC(=O)CCC(=O)Nc1nn[nH]n1)c1ccccc1
: