Target
Trifunctional purine biosynthetic protein adenosine-3
Ligand
BDBM50280414
Substrate
Meas. Tech.
ChEBML_73022
Ki
0.000630±n/a nM
Citation
 Shih, CGrindey, GBTaylor, ECHarrington, PM Synthesis and biological activity of nor- and homo-5,10-dideazatetrahydrofolic acid Bioorg Med Chem Lett 2:339-342 (1992)    Article 
Target
Name:
Trifunctional purine biosynthetic protein adenosine-3
Synonyms:
GAR transformylase PUR2_MOUSE
Type:
PROTEIN
Mol. Mass.:
107504.27
Organism:
Mus musculus
Description:
ChEMBL_497843
Residue:
1010
  
Inhibitor
Name:
BDBM50280414
Synonyms:
(R)-2-[4-(2-Amino-4-oxo-3,4,5,6,7,8-hexahydro-pyrido[2,3-d]pyrimidin-6-ylmethyl)-benzoylamino]-pentanedioic acid | CHEMBL326511
Type:
Small organic molecule
Emp. Form.:
C20H23N5O6
Mol. Mass.:
429.4265
SMILES:
Nc1nc2NCC(Cc3ccc(cc3)C(=O)N[C@H](CCC(O)=O)C(O)=O)Cc2c(=O)[nH]1
: