Target
D(1A) dopamine receptor
Ligand
BDBM50280428
Substrate
Meas. Tech.
ChEBML_58794
Ki
100±n/a nM
Citation
 Chang, WKPeters, MFevig, VPKozlowski, JAZhou, GLowe, DBGuzik, HMcQuade, RDDuffy, RCoffin, VLBerger, JG Dopamine receptor binding properties of some 2,3,4,5-tetrahydro-1H-3-benzazepine-7-ols with non-aromatic substituents in the 5-position Bioorg Med Chem Lett 2:399-402 (1992)    Article 
Target
Name:
D(1A) dopamine receptor
Synonyms:
DOPAMINE D1 Dopamine D1 high Dopamine receptor Dopamine1-like Drd1a
Type:
Enzyme Catalytic Domain
Mol. Mass.:
49429.75
Organism:
RAT
Description:
P18901
Residue:
446
  
Inhibitor
Name:
BDBM50280428
Synonyms:
8-Chloro-3-methyl-5-piperidin-1-yl-2,3,4,5-tetrahydro-1H-benzo[d]azepin-7-ol | CHEMBL334650
Type:
Small organic molecule
Emp. Form.:
C16H23ClN2O
Mol. Mass.:
294.82
SMILES:
CN1CCc2cc(Cl)c(O)cc2C(C1)N1CCCCC1
: