Target
D(2) dopamine receptor
Ligand
BDBM50280439
Substrate
Meas. Tech.
ChEBML_63050
Ki
284±n/a nM
Citation
 Chang, WKPeters, MFevig, VPKozlowski, JAZhou, GLowe, DBGuzik, HMcQuade, RDDuffy, RCoffin, VLBerger, JG Dopamine receptor binding properties of some 2,3,4,5-tetrahydro-1H-3-benzazepine-7-ols with non-aromatic substituents in the 5-position Bioorg Med Chem Lett 2:399-402 (1992)    Article 
Target
Name:
D(2) dopamine receptor
Synonyms:
DOPAMINE D2 DOPAMINE D2 Short Dopamine D2 receptor Drd2
Type:
G Protein-Coupled Receptor (GPCR)
Mol. Mass.:
50931.60
Organism:
Rattus norvegicus (rat)
Description:
P61169
Residue:
444
  
Inhibitor
Name:
BDBM50280439
Synonyms:
5-Allyl-8-chloro-3-methyl-2,3,4,5-tetrahydro-1H-benzo[d]azepin-7-ol | CHEMBL334728
Type:
Small organic molecule
Emp. Form.:
C14H18ClNO
Mol. Mass.:
251.752
SMILES:
CN1CCc2cc(Cl)c(O)cc2C(CC=C)C1
: