Target
5-hydroxytryptamine receptor 3A/3B
Ligand
BDBM50280497
Substrate
Meas. Tech.
ChEMBL_3006 (CHEMBL619796)
Ki
0.900000±n/a nM
Citation
 Langlois, MSoulier, JLBrémont, BShen, SRampillon, VGiudice, A Derivatives of naphthalimide: new potent conformationally restricted antagonists of 5-HT3 receptors. Bioorg Med Chem Lett 2:691-694 (1992)    Article 
Target
Name:
5-hydroxytryptamine receptor 3A/3B
Synonyms:
Serotonin 3 (5-HT3) receptor | Serotonin 3a (5-HT3a)/3b (5-HT3b) receptor
Type:
Mol. Mass.:
Description:
ASSAY_ID of EBI is 2974
Components:
This complex has 2 components.
Component 1
Name:
5-hydroxytryptamine receptor 3B
Synonyms:
5HT3B_RAT Serotonin (5-HT) receptor
Type:
PROTEIN
Mol. Mass.:
50328.78
Organism:
Rattus norvegicus
Description:
EBI_11885
Residue:
437
  
Component 2
Name:
5-hydroxytryptamine receptor 3A
Synonyms:
5-HT3 5HT3A_RAT Htr3 Serotonin (5-HT) receptor | Zacopride site-R
Type:
Enzyme Catalytic Domain
Mol. Mass.:
55428.70
Organism:
RAT
Description:
5-HT3 HTR3A RAT::P35563
Residue:
483
  
Inhibitor
Name:
BDBM50280497
Synonyms:
(R)-2-(1-Aza-bicyclo[2.2.2]oct-3-yl)-benzo[de]isoquinoline-1,3-dione | CHEMBL161922
Type:
Small organic molecule
Emp. Form.:
C19H18N2O2
Mol. Mass.:
306.3584
SMILES:
O=C1N([C@H]2CN3CCC2CC3)C(=O)c2cccc3cccc1c23
: