Target
Polyunsaturated fatty acid 5-lipoxygenase
Ligand
BDBM17638
Substrate
Meas. Tech.
ChEBML_3894
IC50
>100000±n/a nM
Citation
 Boschelli, DHConnor, DTKuipers, PJWright, CD Synthesis and cyclooxygenase and 5-lipoxygenase inhibitory activity of some thiazolidene-4-one analogs of meclofenamic acid Bioorg Med Chem Lett 2:705-708 (1992)    Article 
Target
Name:
Polyunsaturated fatty acid 5-lipoxygenase
Synonyms:
Alox5 LOX5_RAT
Type:
PROTEIN
Mol. Mass.:
78082.31
Organism:
Rattus norvegicus
Description:
ChEMBL_1432947
Residue:
673
  
Inhibitor
Name:
BDBM17638
Synonyms:
2-{1-[(4-chlorophenyl)carbonyl]-5-methoxy-2-methyl-1H-indol-3-yl}acetic acid Indocin US11478464, Compound Indomethacin US9271961, Indomethacin | indometacin
Type:
Small organic molecule
Emp. Form.:
C19H16ClNO4
Mol. Mass.:
357.788
SMILES:
COc1ccc2n(C(=O)c3ccc(Cl)cc3)c(C)c(CC(O)=O)c2c1
: