Target
Muscarinic acetylcholine receptor M3
Ligand
BDBM50065205
Substrate
Meas. Tech.
ChEBML_88157
EC50
16400±n/a nM
Citation
 Tecle, HMirzadegan, TMoos, WHMoreland, DWPavia, MRSchwarz, RDDavis, RE A rationale for the design and synthesis of m1 selective muscarinic agonists. Bioorg Med Chem Lett 2:821-826 (1992)    Article 
Target
Name:
Muscarinic acetylcholine receptor M3
Synonyms:
ACM3_HUMAN Cholinergic, muscarinic M3 Muscarinic receptor M3 | RecName: Full=Muscarinic acetylcholine receptor M3
Type:
Enzyme
Mol. Mass.:
66151.03
Organism:
Homo sapiens (Human)
Description:
P20309
Residue:
590
  
Inhibitor
Name:
BDBM50065205
Synonyms:
1-Aza-bicyclo[2.2.1]heptan-3-one O-hexa-2,5-diynyl-oxime | CHEMBL313918
Type:
Small organic molecule
Emp. Form.:
C12H14N2O
Mol. Mass.:
202.2524
SMILES:
C#CCC#CCO\N=C1/CN2CCC1C2
: