Target
Muscarinic acetylcholine receptor M1
Ligand
BDBM50065213
Substrate
Meas. Tech.
ChEMBL_138273 (CHEMBL744230)
EC50
890±n/a nM
Citation
 Tecle, HMirzadegan, TMoos, WHMoreland, DWPavia, MRSchwarz, RDDavis, RE A rationale for the design and synthesis of m1 selective muscarinic agonists. Bioorg Med Chem Lett 2:821-826 (1992)    Article 
Target
Name:
Muscarinic acetylcholine receptor M1
Synonyms:
ACM1_HUMAN Cholinergic receptor, muscarinic 1 | Cholinergic, muscarinic M1
Type:
Protein
Mol. Mass.:
51442.54
Organism:
Homo sapiens (Human)
Description:
P11229
Residue:
460
  
Inhibitor
Name:
BDBM50065213
Synonyms:
1-Aza-bicyclo[2.2.1]heptan-3-one O-prop-2-ynyl-oxime | CHEMBL315676
Type:
Small organic molecule
Emp. Form.:
C9H12N2O
Mol. Mass.:
164.2044
SMILES:
C#CCO\N=C1/CN2CCC1C2
: