Target
Muscarinic acetylcholine receptor M2
Ligand
BDBM50280621
Substrate
Meas. Tech.
ChEBML_138160
Ki
3.7±n/a nM
Citation
 Jacobson, KAKarton, YBaumgold, J Muscarinic receptor probes based on amine congeners of pirenzepine and telenzepine Bioorg Med Chem Lett 2:845-850 (1992)    Article 
Target
Name:
Muscarinic acetylcholine receptor M2
Synonyms:
ACM2_RAT Chrm-2 | Chrm2
Type:
Enzyme Catalytic Domain
Mol. Mass.:
51555.53
Organism:
RAT
Description:
P10980
Residue:
466
  
Inhibitor
Name:
BDBM50280621
Synonyms:
4-{2-[4-(10-Amino-decyl)-piperazin-1-yl]-acetyl}-3-methyl-4,9-dihydro-2-thia-4,9-diaza-benzo[f]azulen-10-one | CHEMBL168329
Type:
Small organic molecule
Emp. Form.:
C28H41N5O2S
Mol. Mass.:
511.722
SMILES:
Cc1scc2c1N(C(=O)CN1CCN(CCCCCCCCCCN)CC1)c1ccccc1NC2=O
: