Target
Acetylcholinesterase
Ligand
BDBM8986
Substrate
Meas. Tech.
ChEBML_28299
IC50
743±n/a nM
Citation
 Gregor, VEEmmerling, MRLee, CMoore, CJ The synthesis and in vitro acetylcholinesterase and butyrylcholinesterase inhibitory activity of tacrine (Cognex®) derivaties Bioorg Med Chem Lett 2:861-864 (1992)    Article 
Target
Name:
Acetylcholinesterase
Synonyms:
ACES_HUMAN Acetylcholinesterase (AChE) | Acetylcholinesterase (human AChE)
Type:
Enzyme
Mol. Mass.:
67792.70
Organism:
Homo sapiens (Human)
Description:
P22303
Residue:
614
  
Inhibitor
Name:
BDBM8986
Synonyms:
7-chloro-1,2,3,4-tetrahydroacridin-9-amine | Tacrine Analogue 3
Type:
Small organic molecule
Emp. Form.:
C13H13ClN2
Mol. Mass.:
232.709
SMILES:
Nc1c2CCCCc2nc2ccc(Cl)cc12
: