Target
Acetylcholinesterase
Ligand
BDBM50029922
Substrate
Meas. Tech.
ChEBML_28922
IC50
>10000±n/a nM
Citation
 Sugimoto, HIimura, YYamanishi, YYamatsu, K Synthesis and anti-acetylcholinesterase activity of 1-benzyl-4-[(5,6-dimethoxy-1-indanon-2-yl)methyl]piperidine hydrochloride (E2020) and related compounds Bioorg Med Chem Lett 2:871-876 (1992)    Article 
Target
Name:
Acetylcholinesterase
Synonyms:
ACES_MOUSE Acetylcholinesterase (mouse AChE) Ache
Type:
Enzyme
Mol. Mass.:
68165.65
Organism:
Mus musculus (mouse)
Description:
Residue:
614
  
Inhibitor
Name:
BDBM50029922
Synonyms:
2-(1-Benzoyl-piperidin-4-ylmethyl)-5,6-dimethoxy-indan-1-one | CHEMBL439626
Type:
Small organic molecule
Emp. Form.:
C24H27NO4
Mol. Mass.:
393.4755
SMILES:
COc1cc2CC(CC3CCN(CC3)C(=O)c3ccccc3)C(=O)c2cc1OC
: