Target
Plasminogen
Ligand
BDBM50280654
Substrate
Meas. Tech.
ChEMBL_155065 (CHEMBL764383)
IC50
500±n/a nM
Citation
 Sall, DJBerry, DRCoffman, WJCraft, TJDenney, MLGifford-Moore, DSKellam, MLSmith, GF Characterization of LY806303 as a potent and selective inhibitor of thrombin Bioorg Med Chem Lett 2:1025-1028 (1992)    Article 
Target
Name:
Plasminogen
Synonyms:
Activation peptide PLG Plasmin Plasmin heavy chain A, short form | Plasmin light chain B
Type:
Enzyme
Mol. Mass.:
90579.18
Organism:
Homo sapiens (Human)
Description:
Residue:
810
  
Inhibitor
Name:
BDBM50280654
Synonyms:
(S)-5-Guanidino-2-{[(S)-1-((S)-2-methylamino-2-phenyl-acetyl)-pyrrolidine-2-carbonyl]-amino}-pentanoic acid | CHEMBL8108
Type:
Small organic molecule
Emp. Form.:
C20H30N6O4
Mol. Mass.:
418.49
SMILES:
CN[C@H](C(=O)N1CCC[C@H]1C(=O)N[C@@H](CCCNC(N)=N)C(O)=O)c1ccccc1
: