Target
3-hydroxy-3-methylglutaryl-coenzyme A reductase
Ligand
BDBM50004774
Substrate
Meas. Tech.
ChEBML_80347
IC50
39±n/a nM
Citation
 Sit, SYParker, RAWright, JJ Synthesis of tetrazol-1-yl analogs of HMG-COA reductase inhibitor BMS180431 (formerly BMY21950) Bioorg Med Chem Lett 2:1085-1088 (1992)    Article 
Target
Name:
3-hydroxy-3-methylglutaryl-coenzyme A reductase
Synonyms:
3-hydroxy-3-methylglutaryl-coenzyme A (HMG-CoA) reductase HMDH_HUMAN HMG-CoA reductase (HMGR) | HMGCR
Type:
Enzyme
Mol. Mass.:
97477.10
Organism:
Homo sapiens (Human)
Description:
P04035
Residue:
888
  
Inhibitor
Name:
BDBM50004774
Synonyms:
(S)-2-Methyl-butyric acid (1S,3R,7S,8S,8aR)-8-[2-((R)-4-hydroxy-6-oxo-tetrahydro-pyran-2-yl)-ethyl]-3,7-dimethyl-1,2,3,7,8,8a-hexahydro-naphthalen-1-yl ester 2-Methyl-butyric acid 8-[2-(4-hydroxy-6-oxo-tetrahydro-pyran-2-yl)-ethyl]-3,7-dimethyl-1,2,3,7,8,8a-hexahydro-naphthalen-1-yl ester CHEMBL503
Type:
Small organic molecule
Emp. Form.:
C24H36O5
Mol. Mass.:
404.5396
SMILES:
CC[C@H](C)C(=O)O[C@H]1C[C@@H](C)C=C2C=C[C@H](C)[C@H](CCC3C[C@@H](O)CC(=O)O3)[C@@H]12
: