Target
Glutamate receptor ionotropic, NMDA 2C
Ligand
BDBM50280812
Substrate
Meas. Tech.
ChEBML_140488
IC50
111±n/a nM
Citation
 Chenard, BLButler, TWShalaby, IAProchniak, MAKoe, BKFox, CB Oxindole N-Methyl-D-Aspartate (NMDA) antagonists Bioorg Med Chem Lett 3:91-94 (1993)    Article 
Target
Name:
Glutamate receptor ionotropic, NMDA 2C
Synonyms:
Glutamate NMDA receptor; Grin1/Grin2c Grin2c NMDE3_RAT
Type:
Protein
Mol. Mass.:
135305.94
Organism:
Rattus norvegicus (Rat)
Description:
Q00961
Residue:
1237
  
Inhibitor
Name:
BDBM50280812
Synonyms:
5-[(1S,2S)-2-(4-Benzyl-piperidin-1-yl)-1-hydroxy-propyl]-1,3-dihydro-indol-2-one | CHEMBL427116
Type:
Small organic molecule
Emp. Form.:
C23H28N2O2
Mol. Mass.:
364.4806
SMILES:
C[C@@H]([C@@H](O)c1ccc2NC(=O)Cc2c1)N1CCC(Cc2ccccc2)CC1
: