Target
Trifunctional purine biosynthetic protein adenosine-3
Ligand
BDBM50281129
Substrate
Meas. Tech.
ChEMBL_73023 (CHEMBL682625)
IC50
65±n/a nM
Citation
 Shih, CHu, YGossett, LSHabeck, LLMendelsohn, LGGrindey, GB Synthesis and biological activity of 2-desamino and 4-deoxy analogs of 5,10-dideazatetrahydrofolic acid (DDATHF) Bioorg Med Chem Lett 3:2657-2660 (1993)    Article 
Target
Name:
Trifunctional purine biosynthetic protein adenosine-3
Synonyms:
GAR transformylase PUR2_MOUSE
Type:
PROTEIN
Mol. Mass.:
107504.27
Organism:
Mus musculus
Description:
ChEMBL_497843
Residue:
1010
  
Inhibitor
Name:
BDBM50281129
Synonyms:
(S)-2-{4-[2-(2-Amino-5,6,7,8-tetrahydro-pyrido[2,3-d]pyrimidin-6-yl)-ethyl]-benzoylamino}-pentanedioic acid | CHEMBL314116
Type:
Small organic molecule
Emp. Form.:
C21H25N5O5
Mol. Mass.:
427.4537
SMILES:
Nc1ncc2CC(CCc3ccc(cc3)C(=O)N[C@@H](CCC(O)=O)C(O)=O)CNc2n1
: