Target
Substance-P receptor
Ligand
BDBM50281198
Substrate
Meas. Tech.
ChEBML_143028
IC50
17±n/a nM
Citation
 Mills, SGWu, MTMacCoss, MBudhu, RJDorn, CPCascieri, MASadowski, SStrader, CDGreenlee, WJ 1,4-Diacylpiperazine-2-(S)-[(N-aminoalkyl)carboxamides] as novel, potent substance P receptor antagonists. Bioorg Med Chem Lett 3:2707-2712 (1993)    Article 
Target
Name:
Substance-P receptor
Synonyms:
NK-1 receptor NK1 Receptor NK1R_HUMAN Neurokinin-1 (NK-1) SPR TACR1 Tachykinin receptor 1 (NK1) | tachykinin
Type:
G Protein-Coupled Receptor (GPCR)
Mol. Mass.:
46254.43
Organism:
Homo sapiens (Human)
Description:
P25103
Residue:
407
  
Inhibitor
Name:
BDBM50281198
Synonyms:
(S)-Piperazine-1,2,4-tricarboxylic acid 4-dipentylamide 1-diphenylamide 2-({2-[(2-methoxy-benzyl)-methyl-amino]-ethyl}-methyl-amide) | CHEMBL431459
Type:
Small organic molecule
Emp. Form.:
C41H58N6O4
Mol. Mass.:
698.937
SMILES:
CCCCCN(CCCCC)C(=O)N1CCN([C@@H](C1)C(=O)N(C)CCN(C)Cc1ccccc1OC)C(=O)N(c1ccccc1)c1ccccc1
: