Target
3-phosphoshikimate 1-carboxyvinyltransferase
Ligand
BDBM50281350
Substrate
Meas. Tech.
ChEBML_65093
IC50
>80000±n/a nM
Citation
 Knowles, WSAnderson, KSAndrew, SSPhillion, DPReam, JEJohnson, KASikorski, JA Synthesis & characterization of N-amino-glyphosate as a potent analog inhibitor of E. coli EPSP synthase. Bioorg Med Chem Lett 3:2863-2868 (1993)    Article 
Target
Name:
3-phosphoshikimate 1-carboxyvinyltransferase
Synonyms:
5-enolpyruvylshikimate-3-phosphate synthase aroA
Type:
PROTEIN
Mol. Mass.:
46089.22
Organism:
Escherichia coli (strain K12)
Description:
ChEMBL_65087
Residue:
427
  
Inhibitor
Name:
BDBM50281350
Synonyms:
(1-Phosphono-ethylamino)-acetic acid | CHEMBL330434
Type:
Small organic molecule
Emp. Form.:
C4H10NO5P
Mol. Mass.:
183.0997
SMILES:
CC(NCC(O)=O)P(O)(O)=O
: