Target
Acyl-CoA:cholesterol acyltransferase
Ligand
BDBM50281490
Substrate
Meas. Tech.
ChEBML_28337
IC50
11±n/a nM
Citation
 Trivedi, BKStoeber, TLStanfield, RLEssenburg, ADHamelehle, KLKrause, BR Substituted N,N′-diphenyl ureas as potent inhibitors of acyl-CoA:Cholesterol acyltransferase (ACAT) Bioorg Med Chem Lett 3:259-262 (1993)    Article 
Target
Name:
Acyl-CoA:cholesterol acyltransferase
Synonyms:
ACAT
Type:
Mol. Mass.:
35405.31
Organism:
Oryctolagus cuniculus
Description:
Residue:
305
  
Inhibitor
Name:
BDBM50281490
Synonyms:
1-(2,6-Diisopropyl-phenyl)-3-(4-tridecyl-phenyl)-urea | CHEMBL87050
Type:
Small organic molecule
Emp. Form.:
C32H50N2O
Mol. Mass.:
478.7522
SMILES:
CCCCCCCCCCCCCc1ccc(NC(=O)Nc2c(cccc2C(C)C)C(C)C)cc1
: