Target
Endothelin receptor type B
Ligand
BDBM50045227
Substrate
Meas. Tech.
ChEBML_64037
IC50
4000±n/a nM
Citation
 Doherty, AMCody, WLHe, JXDePue, PLLeonard, DMJr., JDHill, KEFlynn, MAReynolds, EE Design of C-terminal peptide antagonists of endothelin: structure-activity relationships of ET-[16–21, D-His16Bioorg Med Chem Lett 3:497-502 (1993)    Article 
Target
Name:
Endothelin receptor type B
Synonyms:
EDNRB_RAT ET-B Endothelin receptor | Endothelin receptor non-selective type
Type:
Enzyme Catalytic Domain
Mol. Mass.:
49483.43
Organism:
RAT
Description:
ENDOTHELIN B EDNRB RAT::P21451
Residue:
442
  
Inhibitor
Name:
BDBM50045227
Synonyms:
(S)-3-[2-((R)-2-Acetylamino-3-phenyl-propionylamino)-5-amino-pentanoylamino]-N-{(S)-1-[(S)-1-((S)-carboxy-2-(S)-1-1H-indol-3-yl-ethylcarbamoyl)-2-(S)-methyl-butylcarbamoyl]-2-methyl-butyl}-succinamic acid CHEMBL2370070
Type:
Small organic molecule
Emp. Form.:
C43H60N8O10
Mol. Mass.:
848.9841
SMILES:
CC[C@H](C)[C@H](NC(=O)[C@@H](NC(=O)[C@H](CC(O)=O)NC(=O)[C@H](CCCN)NC(=O)[C@@H](Cc1ccccc1)NC(C)=O)[C@@H](C)CC)C(=O)N[C@@H](Cc1c[nH]c2ccccc12)C(O)=O
: