Target
Gastrin/cholecystokinin type B receptor
Ligand
BDBM50281634
Substrate
Meas. Tech.
ChEBML_48763
Ki
1.7±n/a nM
Citation
 Horwell, DCHowson, WRatcliffe, GSRees, DC The design of a dipeptide library for screening at peptide receptor sites Bioorg Med Chem Lett 3:799-802 (1993)    Article 
Target
Name:
Gastrin/cholecystokinin type B receptor
Synonyms:
CCK-2 receptor CCK-BR CCKRB Cholecystokinin receptor GASR_HUMAN | Gastrin/cholecystokinin type B receptor
Type:
G Protein-Coupled Receptor (GPCR)
Mol. Mass.:
48445.79
Organism:
Homo sapiens (Human)
Description:
Stable expression of human CCK-2 receptors in HEK 293 cells.
Residue:
447
  
Inhibitor
Name:
BDBM50281634
Synonyms:
3-{(R)-2-Amino-2-[(R)-2-(3-carboxy-propionylamino)-2-phenyl-ethylcarbamoyl]-propyl}-indole-1-carboxylic acid adamantan-2-yl ester | CHEMBL165869
Type:
Small organic molecule
Emp. Form.:
C35H42N4O6
Mol. Mass.:
614.7312
SMILES:
C[C@@](N)(Cc1cn(C(=O)OC2C3CC4CC(C3)CC2C4)c2ccccc12)C(=O)NC[C@H](NC(=O)CCC(O)=O)c1ccccc1
: