Target
Neprilysin
Ligand
BDBM21641
Substrate
Meas. Tech.
ChEBML_144313
IC50
40±n/a nM
Citation
 James, KPalmer, MJ Gem-cycloalkyl substituted thiol inhibitors of neutral endopeptidase 24.11. Synthesis via nucleophilic opening of 2,2-spiro-β-lactones Bioorg Med Chem Lett 3:825-830 (1993)    Article 
Target
Name:
Neprilysin
Synonyms:
Mme Neprilysin Neutral endopeptidase 24.11
Type:
Protein
Mol. Mass.:
85789.59
Organism:
Rattus norvegicus (Rat)
Description:
P07861
Residue:
750
  
Inhibitor
Name:
BDBM21641
Synonyms:
2-(2-benzyl-3-sulfanylpropanamido)acetic acid Thiorphan
Type:
Small organic molecule
Emp. Form.:
C12H15NO3S
Mol. Mass.:
253.317
SMILES:
OC(=O)CNC(=O)C(CS)Cc1ccccc1
: