Target
Neurotensin receptor type 1
Ligand
BDBM50281786
Substrate
Meas. Tech.
ChEMBL_144293 (CHEMBL754794)
Ki
4.5±n/a nM
Citation
 Henry, JAHorwell, DCMeecham, KGRees, DC A structure-affinity study of the amino acid side-chains in neurotensin : N and C terminal deletions and Ala-scan Bioorg Med Chem Lett 3:949-952 (1993)    Article 
Target
Name:
Neurotensin receptor type 1
Synonyms:
NT-R-1 Neurotensin 1 Neurotensin receptor type 1 Ntsr1
Type:
Enzyme Catalytic Domain
Mol. Mass.:
47237.04
Organism:
MOUSE
Description:
Neurotensin 1 NTSR1 MOUSE::A2ACT4
Residue:
424
  
Inhibitor
Name:
BDBM50281786
Synonyms:
2-{(S)-2-[2-({(S)-1-[(S)-2-((S)-2-Amino-5-guanidino-pentanoylamino)-5-guanidino-pentanoyl]-pyrrolidine-2-carbonyl}-amino)-3-(4-hydroxy-phenyl)-propionylamino]-propionylamino}-4-methyl-pentanoic acid | CHEMBL172313
Type:
Small organic molecule
Emp. Form.:
C35H58N12O8
Mol. Mass.:
774.9106
SMILES:
CC(C)C[C@H](NC(=O)[C@H](C)NC(=O)[C@H](Cc1ccc(O)cc1)NC(=O)[C@@H]1CCCN1C(=O)[C@H](CCCNC(N)=N)NC(=O)[C@@H](N)CCCNC(N)=N)C(O)=O
: