Target
Leukotriene B4 receptor 1
Ligand
BDBM50281877
Substrate
Meas. Tech.
ChEMBL_98514 (CHEMBL706536)
IC50
23±n/a nM
Citation
 Sofia, MJFloreancig, PJackson, WTMarder, PSaussy, DLSilbaugh, SACockerham, SLFroelich, LLRoman, CRStengel, PWFleisch, JH Acid unit modifications of 1,2,4,5-substituted hydroxyacetophenones and the effect on in vitro and in vivo LTB4 receptor antagonism Bioorg Med Chem Lett 3:1147-1152 (1993)    Article 
Target
Name:
Leukotriene B4 receptor 1
Synonyms:
BLT BLTR Chemoattractant receptor-like 1 GPR16 LTB4-R 1 Leukotriene B4 R1 Leukotriene B4 receptor 1 P2Y purinoceptor 7 | P2Y7
Type:
Enzyme Catalytic Domain
Mol. Mass.:
37582.68
Organism:
Homo sapiens (Human)
Description:
Q15722
Residue:
352
  
Inhibitor
Name:
BDBM50281877
Synonyms:
2-{3-[3-(4-Acetyl-2-ethyl-5-hydroxy-phenoxy)-propoxy]-2-propyl-phenoxy}-propionic acid | CHEMBL15299
Type:
Small organic molecule
Emp. Form.:
C25H32O7
Mol. Mass.:
444.5174
SMILES:
CCCc1c(OCCCOc2cc(O)c(cc2CC)C(C)=O)cccc1OC(C)C(O)=O
: