Target
Type-1 angiotensin II receptor
Ligand
BDBM50041970
Substrate
Meas. Tech.
ChEMBL_36926 (CHEMBL652721)
IC50
1.6±n/a nM
Citation
 de Laszlo, SEAllen, EEQuagliato, CSGreenlee, WJPatchett, AANachbar, RBSieg, PKChang, RSKivlighn, SDSchorn, TSFaust, KAChen, TBZingaro, GJLotti, VJ Quinazolinones 2: QSAR and in vivo characterization of AT1 selective AII antagonists Bioorg Med Chem Lett 3:1299-1304 (1993)    Article 
Target
Name:
Type-1 angiotensin II receptor
Synonyms:
AGTR1 ANGIOTENSIN AT1 Angiotensin II type 1a (AT-1a) receptor
Type:
Enzyme Catalytic Domain
Mol. Mass.:
41009.15
Organism:
RABBIT
Description:
ANGIOTENSIN AT1 AGTR1 RABBIT::P34976
Residue:
359
  
Inhibitor
Name:
BDBM50041970
Synonyms:
CHEMBL280526 | {2-Butyl-4-oxo-3-[2'-(2H-tetrazol-5-yl)-biphenyl-4-ylmethyl]-3,4-dihydro-quinazolin-6-yl}-carbamic acid isobutyl ester
Type:
Small organic molecule
Emp. Form.:
C31H33N7O3
Mol. Mass.:
551.6388
SMILES:
CCCCc1nc2ccc(NC(=O)OCC(C)C)cc2c(=O)n1Cc1ccc(cc1)-c1ccccc1-c1nnn[nH]1
: