Target
Type-1 angiotensin II receptor
Ligand
BDBM50281958
Substrate
Meas. Tech.
ChEBML_36928
IC50
30±n/a nM
Citation
 de Laszlo, SEAllen, EEQuagliato, CSGreenlee, WJPatchett, AANachbar, RBSieg, PKChang, RSKivlighn, SDSchorn, TSFaust, KAChen, TBZingaro, GJLotti, VJ Quinazolinones 2: QSAR and in vivo characterization of AT1 selective AII antagonists Bioorg Med Chem Lett 3:1299-1304 (1993)    Article 
Target
Name:
Type-1 angiotensin II receptor
Synonyms:
AGTR1 ANGIOTENSIN AT1 Angiotensin II type 1a (AT-1a) receptor
Type:
Enzyme Catalytic Domain
Mol. Mass.:
41009.15
Organism:
RABBIT
Description:
ANGIOTENSIN AT1 AGTR1 RABBIT::P34976
Residue:
359
  
Inhibitor
Name:
BDBM50281958
Synonyms:
2-Butyl-6-(4-chloro-phenyl)-3-[2'-(2H-tetrazol-5-yl)-biphenyl-4-ylmethyl]-3H-quinazolin-4-one | CHEMBL24764
Type:
Small organic molecule
Emp. Form.:
C32H27ClN6O
Mol. Mass.:
547.049
SMILES:
CCCCc1nc2ccc(cc2c(=O)n1Cc1ccc(cc1)-c1ccccc1-c1nnn[nH]1)-c1ccc(Cl)cc1
: