Target
Type-1 angiotensin II receptor
Ligand
BDBM50282222
Substrate
Meas. Tech.
ChEMBL_36159 (CHEMBL646971)
EC50
500±n/a nM
Citation
 Bantick, JRBeaton, HGCooper, SLHill, SHirst, SCMcInally, TSpencer, JTinker, ACWillis, PA New non-peptide angiotensin II receptor antagonists. 2: structure - activity relationship of a series of annelated 2(1H)-pyridinones Bioorg Med Chem Lett 4:127-132 (1994)    Article 
Target
Name:
Type-1 angiotensin II receptor
Synonyms:
AGTR1 Angiotensin II type 1a (AT-1a) receptor
Type:
PROTEIN
Mol. Mass.:
41107.81
Organism:
Bos taurus
Description:
ChEMBL_36779
Residue:
359
  
Inhibitor
Name:
BDBM50282222
Synonyms:
7-Ethoxy-4-hydroxy-3-phenyl-1-[2'-(1H-tetrazol-5-yl)-biphenyl-4-ylmethyl]-1H-quinolin-2-one | CHEMBL282566
Type:
Small organic molecule
Emp. Form.:
C31H25N5O3
Mol. Mass.:
515.5619
SMILES:
CCOc1ccc2c(O)c(-c3ccccc3)c(=O)n(Cc3ccc(cc3)-c3ccccc3-c3nnn[nH]3)c2c1
: