Target
Type-1 angiotensin II receptor
Ligand
BDBM50282291
Substrate
Meas. Tech.
ChEMBL_36163 (CHEMBL646975)
IC50
65±n/a nM
Citation
 Yanagisawa, HAmemiya, YKanazaki, TFujimoto, KShimoji, YFujimoto, YSada, TMizuno, MKoike, H Angiotensin II receptor antagonists: imidazoles and pyrroles bearing hydroxymethyl and carboxy substituents Bioorg Med Chem Lett 4:177-182 (1994)    Article 
Target
Name:
Type-1 angiotensin II receptor
Synonyms:
AGTR1 Angiotensin II type 1a (AT-1a) receptor
Type:
PROTEIN
Mol. Mass.:
41107.81
Organism:
Bos taurus
Description:
ChEMBL_36779
Residue:
359
  
Inhibitor
Name:
BDBM50282291
Synonyms:
2-Butyl-3-(2'-carboxy-biphenyl-4-ylmethyl)-5-hydroxymethyl-3H-imidazole-4-carboxylic acid | CHEMBL299809
Type:
Small organic molecule
Emp. Form.:
C23H24N2O5
Mol. Mass.:
408.4471
SMILES:
CCCCc1nc(CO)c(C(O)=O)n1Cc1ccc(cc1)-c1ccccc1C(O)=O
: