Target
Type-2 angiotensin II receptor
Ligand
BDBM50282307
Substrate
Meas. Tech.
ChEMBL_35560 (CHEMBL645745)
IC50
130±n/a nM
Citation
 Kevin, NJRivero, RAGreenlee, WJChang, RSChen, TB Subtituted phenylthiophene benzoylsulfonamides with potent binding affinity to angiotensin II AT1 and AT2 receptors Bioorg Med Chem Lett 4:189-194 (1994)    Article 
Target
Name:
Type-2 angiotensin II receptor
Synonyms:
AGTR2_RAT Agtr2 Angiotensin II receptor Type-2 angiotensin II receptor
Type:
Enzyme Catalytic Domain
Mol. Mass.:
41346.62
Organism:
RAT
Description:
Angiotensin II AT2 0 0::P35351
Residue:
363
  
Inhibitor
Name:
BDBM50282307
Synonyms:
3-[4-(2-Ethyl-5,7-dimethyl-imidazo[4,5-b]pyridin-3-ylmethyl)-phenyl]-5-propyl-thiophene-2-sulfonic acid benzoylamide | CHEMBL56549
Type:
Small organic molecule
Emp. Form.:
C31H32N4O3S2
Mol. Mass.:
572.741
SMILES:
CCCc1cc(c(s1)S(=O)(=O)NC(=O)c1ccccc1)-c1ccc(Cn2c(CC)nc3c(C)cc(C)nc23)cc1
: