Target
Type-1 angiotensin II receptor B
Ligand
BDBM50049201
Substrate
Meas. Tech.
ChEMBL_34944 (CHEMBL647787)
Ki
2.9±n/a nM
Citation
 Lloyd, JRyono, DEBird, JEBuote, JDelaney, CLDejneka, TDickinson, KEMoreland, SNormandin, DESkwish, SSpitzmiller, ERWaldron, TL Quinoline-4-carboxylic acids as angiotensin II receptor antagonists Bioorg Med Chem Lett 4:195-200 (1994)    Article 
Target
Name:
Type-1 angiotensin II receptor B
Synonyms:
AGTRB_RAT Agtr1 Angiotensin II AT1B Angiotensin II type 1b (AT-1b) receptor Type-1B angiotensin II receptor
Type:
Enzyme Catalytic Domain
Mol. Mass.:
40929.44
Organism:
RAT
Description:
Angiotensin II AT1B 0 RAT::P29089
Residue:
359
  
Inhibitor
Name:
BDBM50049201
Synonyms:
2-Cyclopropyl-3-[2'-(1H-tetrazol-5-yl)-biphenyl-4-ylmethoxy]-quinoline-4-carboxylic acid BMS-183920 | CHEMBL305365
Type:
Small organic molecule
Emp. Form.:
C27H21N5O3
Mol. Mass.:
463.4873
SMILES:
OC(=O)c1c(OCc2ccc(cc2)-c2ccccc2-c2nnn[nH]2)c(nc2ccccc12)C1CC1
: