Target
Type-1 angiotensin II receptor B
Ligand
BDBM50282315
Substrate
Meas. Tech.
ChEMBL_34944 (CHEMBL647787)
Ki
5.9±n/a nM
Citation
 Lloyd, JRyono, DEBird, JEBuote, JDelaney, CLDejneka, TDickinson, KEMoreland, SNormandin, DESkwish, SSpitzmiller, ERWaldron, TL Quinoline-4-carboxylic acids as angiotensin II receptor antagonists Bioorg Med Chem Lett 4:195-200 (1994)    Article 
Target
Name:
Type-1 angiotensin II receptor B
Synonyms:
AGTRB_RAT Agtr1 Angiotensin II AT1B Angiotensin II type 1b (AT-1b) receptor Type-1B angiotensin II receptor
Type:
Enzyme Catalytic Domain
Mol. Mass.:
40929.44
Organism:
RAT
Description:
Angiotensin II AT1B 0 RAT::P29089
Residue:
359
  
Inhibitor
Name:
BDBM50282315
Synonyms:
2-Ethyl-3-[2'-(2H-tetrazol-5-yl)-biphenyl-4-yloxy]-quinoline-4-carboxylic acid | CHEMBL57907
Type:
Small organic molecule
Emp. Form.:
C25H19N5O3
Mol. Mass.:
437.4501
SMILES:
CCc1nc2ccccc2c(C(O)=O)c1Oc1ccc(cc1)-c1ccccc1-c1nnn[nH]1
: