Target
Type-1 angiotensin II receptor
Ligand
BDBM50240609
Substrate
Meas. Tech.
ChEMBL_36168 (CHEMBL646980)
IC50
110±n/a nM
Citation
 Cho, NKubo, KFuruya, SSugiura, YYasuma, TKohara, YOjima, MInada, YNishikawa, KNaka, T A new class of diacidic nonpeptide angiotensin II receptor antagonists Bioorg Med Chem Lett 4:35-40 (1994)    Article 
Target
Name:
Type-1 angiotensin II receptor
Synonyms:
AGTR1 Angiotensin II type 1a (AT-1a) receptor
Type:
PROTEIN
Mol. Mass.:
41107.81
Organism:
Bos taurus
Description:
ChEMBL_36779
Residue:
359
  
Inhibitor
Name:
BDBM50240609
Synonyms:
2-Ethoxy-3-[2'-(1H-tetrazol-5-yl)-biphenyl-4-ylmethyl]-3H-benzoimidazole-4-carboxylic acid(CV-11974) 2-ethoxy-3-[2'-(1H-tetrazol-5-yl)-biphenyl-4-ylmethyl]-3H-benzoimidazole-4-carboxylic acid CHEMBL1016 | CV-11974
Type:
Small organic molecule
Emp. Form.:
C24H20N6O3
Mol. Mass.:
440.454
SMILES:
CCOc1nc2cccc(C(O)=O)c2n1Cc1ccc(cc1)-c1ccccc1-c1nnn[nH]1
: