Target
Type-1 angiotensin II receptor
Ligand
BDBM50282416
Substrate
Meas. Tech.
ChEMBL_36953 (CHEMBL648856)
IC50
2±n/a nM
Citation
 Naylor, EMChakravarty, PKCostello, CAChang, RSChen, TBFaust, KALotti, VJKivlighn, SDZingaro, GJSiegl, PKWong, PCCarini, DJWexler, RRPatchett, AAGreenlee, WJ Potent imidazole angiotensinII antagonists: acyl sulfonamides and acyl sulfamides as tetrazole replacements Bioorg Med Chem Lett 4:69-74 (1994)    Article 
Target
Name:
Type-1 angiotensin II receptor
Synonyms:
AGTR1 ANGIOTENSIN AT1 Angiotensin II type 1a (AT-1a) receptor
Type:
Enzyme Catalytic Domain
Mol. Mass.:
41009.15
Organism:
RABBIT
Description:
ANGIOTENSIN AT1 AGTR1 RABBIT::P34976
Residue:
359
  
Inhibitor
Name:
BDBM50282416
Synonyms:
3-(2'-Benzoylsulfamoyl-biphenyl-4-ylmethyl)-2-butyl-5-chloro-3H-imidazole-4-carboxylic acid | CHEMBL165354
Type:
Small organic molecule
Emp. Form.:
C28H26ClN3O5S
Mol. Mass.:
552.041
SMILES:
CCCCc1nc(Cl)c(C(O)=O)n1Cc1ccc(cc1)-c1ccccc1S(=O)(=O)NC(=O)c1ccccc1
: