Target
Type-2 angiotensin II receptor
Ligand
BDBM50283213
Substrate
Meas. Tech.
ChEBML_35562
IC50
1±n/a nM
Citation
 Santella, JBDuncia, JVEnsinger, CLVanAtten, MKCarini, DJWexler, RRChiu, ATWong, PCTimmermans, PB Balanced angiotensin II receptor antagonists. III. The effects of substitution at the imidazole 5-position. Bioorg Med Chem Lett 4:2235-2240 (1994)    Article 
Target
Name:
Type-2 angiotensin II receptor
Synonyms:
AGTR2 AT2 Angiotensin II type 2 (AT-2) receptor Type-2 angiotensin II receptor
Type:
Enzyme Catalytic Domain
Mol. Mass.:
41201.61
Organism:
Homo sapiens (Human)
Description:
Angiotensin II, central 0 0::P50052
Residue:
363
  
Inhibitor
Name:
BDBM50283213
Synonyms:
Biphenylsulfonylcarbamate compound | CHEMBL307318
Type:
Small organic molecule
Emp. Form.:
C37H43FN4O7S
Mol. Mass.:
706.823
SMILES:
CCCCCOC(=O)NS(=O)(=O)c1ccccc1-c1ccc(Cn2c(CCC)nc(CC)c2C(=O)OCCC(=O)Nc2ccccc2)c(F)c1
: