Target
Type-1 angiotensin II receptor
Ligand
BDBM50283245
Substrate
Meas. Tech.
ChEBML_35129
IC50
0.100000±n/a nM
Citation
 Santella, JBDuncia, JVEnsinger, CLVanAtten, MKCarini, DJWexler, RRChiu, ATWong, PCTimmermans, PB Balanced angiotensin II receptor antagonists. III. The effects of substitution at the imidazole 5-position. Bioorg Med Chem Lett 4:2235-2240 (1994)    Article 
Target
Name:
Type-1 angiotensin II receptor
Synonyms:
AGTR1 AGTR1B AT1 AT1BR AT2R1B Angiotensin II receptor Type-1 angiotensin II receptor (AT1)
Type:
Protein
Mol. Mass.:
41080.75
Organism:
Homo sapiens (Human)
Description:
P30556
Residue:
359
  
Inhibitor
Name:
BDBM50283245
Synonyms:
Biphenylsulfonylcarbamate compound | CHEMBL70789
Type:
Small organic molecule
Emp. Form.:
C36H42FN3O7S
Mol. Mass.:
679.798
SMILES:
CCCc1nc(CC)c(C(=O)OCc2ccccc2OC)n1Cc1ccc(cc1F)-c1ccccc1S(=O)(=O)NC(=O)OCCC(C)C
: