Target
Type-1 angiotensin II receptor
Ligand
BDBM50283249
Substrate
Meas. Tech.
ChEBML_35129
IC50
0.200000±n/a nM
Citation
 Santella, JBDuncia, JVEnsinger, CLVanAtten, MKCarini, DJWexler, RRChiu, ATWong, PCTimmermans, PB Balanced angiotensin II receptor antagonists. III. The effects of substitution at the imidazole 5-position. Bioorg Med Chem Lett 4:2235-2240 (1994)    Article 
Target
Name:
Type-1 angiotensin II receptor
Synonyms:
AGTR1 AGTR1B AT1 AT1BR AT2R1B Angiotensin II receptor Type-1 angiotensin II receptor (AT1)
Type:
Protein
Mol. Mass.:
41080.75
Organism:
Homo sapiens (Human)
Description:
P30556
Residue:
359
  
Inhibitor
Name:
BDBM50283249
Synonyms:
Biphenylsulfonylcarbamate compound | CHEMBL308323
Type:
Small organic molecule
Emp. Form.:
C37H44FN3O8S2
Mol. Mass.:
741.889
SMILES:
CCCc1nc(CC)c(C(=O)OCCCS(=O)(=O)c2ccccc2)n1Cc1ccc(cc1F)-c1ccccc1S(=O)(=O)NC(=O)OCCC(C)C
: