Target
Type-1 angiotensin II receptor
Ligand
BDBM50049181
Substrate
Meas. Tech.
ChEBML_36794
IC50
4±n/a nM
Citation
 Glinka, TWde Laszlo, SESiegl, PKChang, RSKivlighn, SDSchorn, TSFaust, KAChen, TBZingaro, GJLotti, VJGreenlee, WJ Development of angiotensin II antagonists with equipotent affinity for human AT1 and AT2 receptor subtypes. Bioorg Med Chem Lett 4:2337-2342 (1994)    Article 
Target
Name:
Type-1 angiotensin II receptor
Synonyms:
AGTR1 AGTR1B AT1 AT1BR AT2R1B Angiotensin II receptor Type-1 angiotensin II receptor (AT1)
Type:
Protein
Mol. Mass.:
41080.75
Organism:
Homo sapiens (Human)
Description:
P30556
Residue:
359
  
Inhibitor
Name:
BDBM50049181
Synonyms:
2-Butyl-3-(2'-(butyloxycarbonylaminosulphonyl)-biphenyl-4-ylmethyl)-6-(N-isopropyl-N-methyl-aminocarbonylamino)-3H-quinazolin-4-one CHEMBL74476 Quinazolinone Analog
Type:
Small organic molecule
Emp. Form.:
C35H43N5O6S
Mol. Mass.:
661.811
SMILES:
CCCCOC(=O)NS(=O)(=O)c1ccccc1-c1ccc(Cn2c(CCCC)nc3ccc(NC(=O)N(C)C(C)C)cc3c2=O)cc1
: