Target
Gag-Pol polyprotein [489-587]
Ligand
BDBM50283362
Substrate
Meas. Tech.
ChEMBL_79973 (CHEMBL690411)
Ki
5±n/a nM
Citation
 Schirlin, DDorsselaer, VVTarnus, CTaylor, DLTyms, ASBaltzer, SWeber, FRemy, JMBrennan, TFarr, RJanowick, D Beneficial replacement of the P1 phenylalanine side chain in HIV-1 protease inhibitors of the difluorostatone type Bioorg Med Chem Lett 4:241-246 (1994)    Article 
Target
Name:
Gag-Pol polyprotein [489-587]
Synonyms:
Human immunodeficiency virus type 1 protease Pol polyprotein | gag-pol
Type:
Enzyme Subunit
Mol. Mass.:
10781.16
Organism:
Human immunodeficiency virus type 1
Description:
P04585[489-587]
Residue:
99
  
Inhibitor
Name:
BDBM50283362
Synonyms:
CHEMBL311049 | {(S)-1-[1-(4-Benzyloxy-benzyl)-3,3-difluoro-4-morpholin-4-yl-2,4-dioxo-butylcarbamoyl]-2-methyl-propyl}-carbamic acid benzyl ester
Type:
Small organic molecule
Emp. Form.:
C35H39F2N3O7
Mol. Mass.:
651.6969
SMILES:
CC(C)[C@H](NC(=O)OCc1ccccc1)C(=O)NC(Cc1ccc(OCc2ccccc2)cc1)C(=O)C(F)(F)C(=O)N1CCOCC1
: