Target
Type-1 angiotensin II receptor
Ligand
BDBM50283589
Substrate
Meas. Tech.
ChEBML_36624
IC50
29±n/a nM
Citation
 Thomas, APRoberts, DAThomason, DA The synthesis and biological activity of tetrahydroquinoline angiotensin II antagonists containing a substituted biphenyltetrazole group Bioorg Med Chem Lett 4:2615-2620 (1994)    Article 
Target
Name:
Type-1 angiotensin II receptor
Synonyms:
AGTR1 AT1 | Angiotensin II type-1 receptor
Type:
PROTEIN
Mol. Mass.:
41004.19
Organism:
Cavia porcellus
Description:
ChEMBL_36783
Residue:
359
  
Inhibitor
Name:
BDBM50283589
Synonyms:
2-Ethyl-4-[2'-methyl-6'-(2H-tetrazol-5-yl)-biphenyl-4-ylmethoxy]-5,6,7,8-tetrahydro-quinoline | CHEMBL86604
Type:
Small organic molecule
Emp. Form.:
C26H27N5O
Mol. Mass.:
425.5255
SMILES:
CCc1cc(OCc2ccc(cc2)-c2c(C)cccc2-c2nnn[nH]2)c2CCCCc2n1
: