Target
Type-2 angiotensin II receptor
Ligand
BDBM50283758
Substrate
Meas. Tech.
ChEBML_36766
IC50
3.5±n/a nM
Citation
 Chang, LLAshton, WTFlanagan, KLRivero, RAChen, TBO'Malley, SSZingaro, GJKivlighn, SDSiegl, PKLotti, VJChang, RSGreenlee, WJ Potent triazolinone-based angiotensin II receptor antagonists with equivalent affinity for both the AT1 and AT2 subtypes Bioorg Med Chem Lett 4:2787-2792 (1994)    Article 
Target
Name:
Type-2 angiotensin II receptor
Synonyms:
AGTR2_RAT Agtr2 Angiotensin II receptor Type-2 angiotensin II receptor
Type:
Enzyme Catalytic Domain
Mol. Mass.:
41346.62
Organism:
RAT
Description:
Angiotensin II AT2 0 0::P35351
Residue:
363
  
Inhibitor
Name:
BDBM50283758
Synonyms:
4'-[3-Butyl-5-oxo-1-(2-trifluoromethyl-phenyl)-1,5-dihydro-[1,2,4]triazol-4-ylmethyl]-3'-fluoro-5-propyl-biphenyl-2-sulfonic acid 2-chloro-benzoylamide | CHEMBL96314
Type:
Small organic molecule
Emp. Form.:
C36H33ClF4N4O4S
Mol. Mass.:
729.183
SMILES:
CCCCc1nn(-c2ccccc2C(F)(F)F)c(=O)n1Cc1ccc(cc1F)-c1cc(CCC)ccc1S(=O)(=O)NC(=O)c1ccccc1Cl
: