Target
Type-1 angiotensin II receptor
Ligand
BDBM50283765
Substrate
Meas. Tech.
ChEBML_36625
IC50
15±n/a nM
Citation
 Chang, LLAshton, WTFlanagan, KLRivero, RAChen, TBO'Malley, SSZingaro, GJKivlighn, SDSiegl, PKLotti, VJChang, RSGreenlee, WJ Potent triazolinone-based angiotensin II receptor antagonists with equivalent affinity for both the AT1 and AT2 subtypes Bioorg Med Chem Lett 4:2787-2792 (1994)    Article 
Target
Name:
Type-1 angiotensin II receptor
Synonyms:
AGTR1 AGTR1B AT1 AT1BR AT2R1B Angiotensin II receptor Type-1 angiotensin II receptor (AT1)
Type:
Protein
Mol. Mass.:
41080.75
Organism:
Homo sapiens (Human)
Description:
P30556
Residue:
359
  
Inhibitor
Name:
BDBM50283765
Synonyms:
CHEMBL321313 | N-{3-[3-Butyl-4-(3-fluoro-2'-(ethyloxtycarbonyl)sulfamoyl-5'-propyl-biphenyl-4-ylmethyl)-5-oxo-4,5-dihydro-[1,2,4]triazol-1-yl]-4-chloro-phenyl}-acetamide
Type:
Small organic molecule
Emp. Form.:
C33H37ClFN5O6S
Mol. Mass.:
686.193
SMILES:
CCCCc1nn(-c2cc(NC(C)=O)ccc2Cl)c(=O)n1Cc1ccc(cc1F)-c1cc(CCC)ccc1S(=O)(=O)NC(=O)OCC
: