Target
Endothelin-1 receptor
Ligand
BDBM50284007
Substrate
Meas. Tech.
ChEMBL_65830 (CHEMBL682963)
IC50
2500±n/a nM
Citation
 Cody, WLHe, JXDePue, PLRapundalo, STHingorani, GPDudley, DTHill, KEReynolds, EEDoherty, AM Structure-activity relationships in a series of monocyclic endothelin analogues Bioorg Med Chem Lett 4:567-572 (1994)    Article 
Target
Name:
Endothelin-1 receptor
Synonyms:
EDNRA ET-A ETA-R Endothelin receptor type A hET-AR
Type:
Enzyme Catalytic Domain
Mol. Mass.:
48736.88
Organism:
Homo sapiens (Human)
Description:
P25101
Residue:
427
  
Inhibitor
Name:
BDBM50284007
Synonyms:
CHEMBL412460 | Trp-Ile-Ile-Asp-Leu-Hisc(Cys-Ser-Ser-Ser-Val-Tyr-Phe-Cys)
Type:
Small organic molecule
Emp. Form.:
C77H107N17O21S2
Mol. Mass.:
1670.905
SMILES:
CC[C@H](C)[C@H](NC(=O)[C@H](CC(O)=O)NC(=O)[C@H](CC(C)C)NC(=O)[C@H](Cc1cnc[nH]1)NC(=O)[C@H]1CSSC[C@H](N)C(=O)N[C@@H](CO)C(=O)N[C@@H](CO)C(=O)N[C@@H](CO)C(=O)N[C@@H](C(C)C)C(=O)N[C@H](Cc2ccc(O)cc2)C(=O)N[C@@H](Cc2ccccc2)C(=O)N1)C(=O)N[C@@H]([C@@H](C)CC)C(=O)N[C@@H](Cc1c[nH]c2ccccc12)C(O)=O
: